{"text_format":"1","workbook":"xlsx","n_sheets":10,"sheets":["Inleiding","Invoer","Resultaten","Berekeningen","Achtergrondgegevens","Bedrijven","Verkoopprijzen","Verpakking","Productiviteit","Opties dropdown"],"not_rendered":{"charts":0,"images":20,"macros":1,"external_links":0,"defined_names":1,"comments":2,"pivot_tables":1},"unopened":[],"bounds":{"document_bytes":16777216,"sheet_cells":100000,"rows_first":2000,"rows_last":500,"rows_between":2000,"halvings":0,"cell_chars":16384,"cell_head_chars":4096},"cells_cut":0,"cells_raw":0,"read":"whole","date_system":"1900"}

{"sheet":"Inleiding","index":0,"n_rows":73,"n_cols":2,"rows_kept":73,"cut":false,"hidden":false,"merged":[]}
[]
[null,"Wat doet deze rekentool? "]
[]
[]
[]
[]
[]
[]
[]
[]
[]
[]
[]
[]
[]
{"$rows_left_out":59}
{"sheet":"Invoer","index":1,"n_rows":43,"n_cols":6,"rows_kept":43,"cut":false,"hidden":false,"merged":[]}
[]
[null,null,"Invoer "]
[null,null,"Invoer voor de berekening van de meerwaarde van uitbestede verwerkingsstappen voor walnoten."]
[]
[null,null,null,null,"Gewicht (kg)","Afzetpercentage"]
[null,null,"Verse Walnoten",null,1000]
[null,null,"Bewerking","Wassen, drogen"]
[]
[null,null,"Ongekraakte, droge walnoten (kg)",null,{"$f":"Achtergrondgegevens!C4*Invoer!E6","v":575}]
[null,null,"Hoeveel ongekraakte walnoten kan je maximaal afzetten? (kg)",null,1000,{"$f":"E10/E9","v":1.7391304347826086}]
[]
[null,null,"Bewerking","Wassen, drogen, machinaal kalibreren "]
[null,null,"Bewerking ","Kraken, schalen verwijderen, sorteren"]
[]
[null,null,"Walnootkernen (kg, als 100% van de noten worden gekraakt)",null,{"$f":"Achtergrondgegevens!C5*E9","v":189.75}]
{"$rows_left_out":29}
{"sheet":"Resultaten","index":2,"n_rows":19,"n_cols":26,"rows_kept":19,"cut":false,"hidden":false,"merged":[]}
[]
[]
[null,"Resultaten: Tabel 1",null,null,null,null,null,null,null,null,null,null,null,null,"Resultaten: Tabel 2"]
[]
[null,null,null,null,"Saldo","Noten in dop",null,"Gekraakt",null,"Olie",null,null,null,null,"Bestaande waardes","(Alle)"]
[null,null,null,null,null,"%","kg","%","kg","%","l"]
[null,"Opbrengsten 100% droge noten in dop",null,null,{"$f":"Berekeningen!BE7","v":2300},1,{"$f":"F7*Invoer!E9","v":575},0,{"$f":"H7*Invoer!E15","v":0},0,{"$f":"J7*Invoer!E20","v":0},null,null,null,"Meerwaarde bij verwerking","% Walnoten verkocht als kern"]
[null,"Maximale opbrengst (theoretisch)",null,null,{"$f":"MAX(Berekeningen!BE7:BE72)","v":3269.7664800000011},{"$f":"_xlfn.XLOOKUP(E8,Berekeningen!BE7:BE72,Berekeningen!BD7:BD72)","v":0},{"$f":"F8*Invoer!E9","v":0},{"$f":"_xlfn.XLOOKUP(E8,Berekeningen!BE7:BE72,Berekeningen!BB7:BB72)","v":0},{"$f":"H8*Invoer!E15","v":0},{"$f":"_xlfn.XLOOKUP(E8,Berekeningen!BE7:BE72,Berekeningen!BC7:BC72)","v":1},{"$f":"J8*Invoer!E20","v":104.36250000000001},null,null,null,"% Walnoten verkocht als olie",0,0.1,0.2,0.3,0.4,0.5,0.6,0.7,0.8,0.9,1]
[null,"Maximale opbrengst (o.b.v. afzetverwachting)",null,null,{"$f":"_xlfn.MAXIFS(Berekeningen!BE7:BE72,Berekeningen!BD7:BD72,\"<=\"&Invoer!F10+0.05,Berekeningen!BB7:BB72,\"<=\"&Invoer!F16+0.05,Berekeningen!BC7:BC72,\"<=\"&Invoer!F21+0.05)","v":3269.7664800000011},{"$f":"_xlfn.XLOOKUP(E9,Berekeningen!BE7:BE72,Berekeningen!BD7:BD72)","v":0},{"$f":"F9*Invoer!E9","v":0},{"$f":"_xlfn.XLOOKUP(E9,Berekeningen!BE7:BE72,Berekeningen!BB7:BB72)","v":0},{"$f":"H9*Invoer!E15","v":0},{"$f":"_xlfn.XLOOKUP(E9,Berekeningen!BE7:BE72,Berekeningen!BC7:BC72)","v":1},{"$f":"J9*Invoer!E20","v":104.36250000000001},null,null,null,0,0,-34.954249999999774,-69.908500000000004,-104.86275000000023,-139.81700000000001,-174.77124999999978,-209.72550000000001,-244.67975000000024,-279.63400000000001,-314.58825000000002,-349.54250000000002]
[null,null,null,null,null,null,null,null,null,null,null,null,null,null,0.1,96.976648000000296,62.022398000000067,27.068148000000292,-7.8861019999999371,-42.840351999999712,-77.794601999999941,-112.74885199999972,-147.70310199999994,-182.65735199999972,-217.61160199999995]
[null,null,null,null,null,null,null,null,null,null,null,null,null,null,0.2,193.95329600000059,158.99904600000036,124.04479600000013,89.090546000000359,54.136296000000584,19.182046000000355,-15.772203999999874,-50.726453999999649,-85.680703999999423]
[null,null,null,null,null,null,null,null,null,null,null,null,null,null,0.3,290.92994399999998,255.97569399999975,221.02144399999952,186.06719399999974,151.11294399999952,116.15869399999974,81.204443999999512,46.250193999999738]
[null,null,null,null,null,null,null,null,null,null,null,null,null,null,0.4,387.90659200000073,352.9523420000005,317.99809199999982,283.04384200000095,248.08959199999981,213.13534200000049,178.18109200000072]
[null,null,null,null,null,null,null,null,null,null,null,null,null,null,0.5,484.88324000000011,449.92899000000034,414.97474000000011,380.02048999999988,345.06624000000011,310.11199000000033]
[null,null,null,null,null,null,null,null,null,null,null,null,null,null,0.6,581.85988799999996,546.90563800000018,511.95138800000041,476.99713800000018,442.04288799999995]
{"$rows_left_out":5}
{"sheet":"Berekeningen","index":3,"n_rows":72,"n_cols":57,"rows_kept":72,"cut":false,"hidden":true,"merged":[[4,13,4,14],[4,16,4,17],[4,18,4,19],[4,20,4,21],[3,1,3,6],[3,8,3,14],[3,16,3,21],[4,1,4,2],[4,3,4,4],[4,5,4,6],[4,8,4,9],[4,10,4,12],[4,42,4,44],[3,53,3,56],[3,42,3,46],[3,48,3,51],[3,23,3,38],[4,23,4,27],[4,28,4,33],[4,34,4,37]]}
[]
[null,"Berekeningen "]
[]
[null,"Gewicht (kg) (ongekraakte) Droge walnoten, totaal toegerekend per staffel ",null,null,null,null,null,null,"Resterend gewicht product (kg/l) na (tussen-)bewerking, per staffel ",null,null,null,null,null,null,null,"Inkomsten (Resterend gewicht product na bewerking (kg/l) * verkoopprijs (€)), per staffel",null,null,null,null,null,null,"Berwerkings- en verpakkingkosten product, per staffel ",null,null,null,null,null,null,null,null,null,null,null,null,null,null,null,null,"Inkomsten (zonder bewerking) - Oud (O)",null,"Saldo Verandering O ( O inkomsten) - N (N inkomsten - N kosten) ",null,null,null,null,null,"Staffels met Saldo Verandering ",null,null,null,null,"Staffels met Saldo "]
[null,"Kernen",null,"Olie ",null,"Droge Walnoot",null,null,"Kernen ",null,"Olie",null,null,"Droge Walnoot",null,null,"Kernen ",null,"Olie ",null,"Droge Walnoot",null,null,"Kernen ",null,null,null,null,"Olie ",null,null,null,null,null,"Droge Walnoot",null,null,null,"Totaal ",null,"Droge Walnoot",null,"Nieuw (N)",null,null,"Oud (O)","O-N"]
[null,"Staffel","Gewicht (kg) ","Staffel","Gewicht (kg)","Staffel","Gewicht (kg)",null,"Staffel ","Gewicht (kg) ","Staffel ","* Gewicht (kg) tussenbewerking tot kernen","Gewicht (l)","Staffel ","Gewicht (kg) ",null,"Staffel","Inkomsten","Staffel","Inkomsten","Staffel","Inkomsten",null,"Staffel ","* Verwerking tot droge noten","Verwerking","Verpakking","Kosten subtotaal","Staffel ","* Verwerking tot kernen","** Verwerking tot kernen","Verwerking tot olie","Verpakking","Kosten subtotaal","Staffel ","Verwerking","Verpakking","Kosten subtotaal","Totaal ",null,"Verkoopprijs * gewicht",null,"Totale inkomsten","* Totale kosten Verwerking en Verpakking","Saldo ",null,"Saldo verandering ",null,"Kernen","Olie ","Droge Walnoot","Saldo verandering ",null,"Kernen","Olie ","Droge Walnoot","Saldo "]
[null,0,{"$f":"B7*Invoer!$E$9","v":0},0,{"$f":"D7*Invoer!$E$9","v":0},{"$f":"100%-D7-B7","v":1},{"$f":"F7*Invoer!$E$9","v":575},null,0,{"$f":"I7*Invoer!$E$15","v":0},0,{"$f":"K7*Invoer!$E$15","v":0},{"$f":"K7*Invoer!$E$20","v":0},{"$f":"100%-K7-I7","v":1},{"$f":"N7*Invoer!$E$9","v":575},null,0,{"$f":"IF(Invoer!$F$28,J7*Invoer!$F$28,J7*Invoer!$D$28)","v":0},0,{"$f":"IF(Invoer!$F$29,M7*Invoer!$F$29,M7*Invoer!$D$29)","v":0},{"$f":"100%-S7-Q7","v":1},{"$f":"IF(Invoer!$F$27,O7*Invoer!$F$27,O7*Invoer!$D$27)","v":3162.5},null,0,{"$f":"Invoer!$D$34*Berekeningen!C7","v":0},{"$f":"Berekeningen!C7*Invoer!$D$35","v":0},{"$f":"IF(Invoer!$F$42,J7*Invoer!$F$42,J7*Invoer!$D$42)","v":0},{"$f":"Y7+Z7+AA7","v":0},0,{"$f":"Invoer!$D$34*E7","v":0},{"$f":"E7*Invoer!$D$35","v":0},{"$f":"L7*Invoer!$D$36","v":0},{"$f":"IF(Invoer!$F$43,Invoer!$F$43*M7,Invoer!$D$43*M7)","v":0},{"$f":"AD7+AE7+AF7+AG7","v":0},{"$f":"100%-AC7-X7","v":1},{"$f":"Invoer!$D$34*Berekeningen!G7","v":575},{"$f":"IF(Invoer!$F$41,Invoer!$F$41*G7,Invoer!$D$41*G7)","v":287.5},{"$f":"AJ7+AK7","v":862.5},{"$f":"AB7+AH7+AL7","v":862.5},null,{"$f":"$V$7","v":3162.5},null,{"$f":"R7+T7+V7","v":3162.5},{"$f":"AM7","v":862.5},{"$f":"AQ7-AR7","v":2300},{"$f":"AO7-$AM$7","v":2300},{"$f":"AS7-AT7","v":0},null,0,0,{"$f":"100%-AX7-AW7","v":1},{"$f":"AU7","v":0},null,0,0,{"$f":"100%-BC7-BB7","v":1},{"$f":"AS7","v":2300}]
[null,0.1,{"$f":"B8*Invoer!$E$9","v":57.5},0,{"$f":"D8*Invoer!$E$9","v":0},{"$f":"100%-D8-B8","v":0.9},{"$f":"F8*Invoer!$E$9","v":517.5},null,0.1,{"$f":"I8*Invoer!$E$15","v":18.975000000000001},0,{"$f":"K8*Invoer!$E$15","v":0},{"$f":"K8*Invoer!$E$20","v":0},0.9,{"$f":"N8*Invoer!$E$9","v":517.5},null,0.1,{"$f":"IF(Invoer!$F$28,J8*Invoer!$F$28,J8*Invoer!$D$28)","v":379.5},0,{"$f":"IF(Invoer!$F$29,M8*Invoer!$F$29,M8*Invoer!$D$29)","v":0},0.9,{"$f":"IF(Invoer!$F$27,O8*Invoer!$F$27,O8*Invoer!$D$27)","v":2846.25},null,0.1,{"$f":"Invoer!$D$34*Berekeningen!C8","v":57.5},{"$f":"Berekeningen!C8*Invoer!$D$35","v":115},{"$f":"IF(Invoer!$F$42,J8*Invoer!$F$42,J8*Invoer!$D$42)","v":11.954250000000002},{"$f":"Y8+Z8+AA8","v":184.45425},0,{"$f":"Invoer!$D$34*E8","v":0},{"$f":"E8*Invoer!$D$35","v":0},{"$f":"L8*Invoer!$D$36","v":0},{"$f":"IF(Invoer!$F$43,Invoer!$F$43*M8,Invoer!$D$43*M8)","v":0},{"$f":"AD8+AE8+AF8+AG8","v":0},0.9,{"$f":"Invoer!$D$34*Berekeningen!G8","v":517.5},{"$f":"IF(Invoer!$F$41,Invoer!$F$41*G8,Invoer!$D$41*G8)","v":258.75},{"$f":"AJ8+AK8","v":776.25},960.70425,null,{"$f":"$V$7","v":3162.5},null,3225.75,{"$f":"AM8","v":960.70425},{"$f":"AQ8-AR8","v":2265.0457500000002},{"$f":"AO8-$AM$7","v":2300},{"$f":"AS8-AT8","v":-34.954249999999774},null,0.1,0,0.9,{"$f":"AU8","v":-34.954249999999774},null,0.1,0,0.9,{"$f":"AS8","v":2265.0457500000002}]
[null,0.2,{"$f":"B9*Invoer!$E$9","v":115},0,{"$f":"D9*Invoer!$E$9","v":0},0.8,{"$f":"F9*Invoer!$E$9","v":460},null,0.2,{"$f":"I9*Invoer!$E$15","v":37.950000000000003},0,{"$f":"K9*Invoer!$E$15","v":0},{"$f":"K9*Invoer!$E$20","v":0},0.8,{"$f":"N9*Invoer!$E$9","v":460},null,0.2,{"$f":"IF(Invoer!$F$28,J9*Invoer!$F$28,J9*Invoer!$D$28)","v":759},0,{"$f":"IF(Invoer!$F$29,M9*Invoer!$F$29,M9*Invoer!$D$29)","v":0},0.8,{"$f":"IF(Invoer!$F$27,O9*Invoer!$F$27,O9*Invoer!$D$27)","v":2530},null,0.2,{"$f":"Invoer!$D$34*Berekeningen!C9","v":115},{"$f":"Berekeningen!C9*Invoer!$D$35","v":230},{"$f":"IF(Invoer!$F$42,J9*Invoer!$F$42,J9*Invoer!$D$42)","v":23.908500000000004},368.9085,0,{"$f":"Invoer!$D$34*E9","v":0},{"$f":"E9*Invoer!$D$35","v":0},{"$f":"L9*Invoer!$D$36","v":0},{"$f":"IF(Invoer!$F$43,Invoer!$F$43*M9,Invoer!$D$43*M9)","v":0},0,0.8,{"$f":"Invoer!$D$34*Berekeningen!G9","v":460},{"$f":"IF(Invoer!$F$41,Invoer!$F$41*G9,Invoer!$D$41*G9)","v":230},690,1058.9085,null,3162.5,null,3289,1058.9085,{"$f":"AQ9-AR9","v":2230.0915},2300,-69.908500000000004,null,0.2,0,0.8,-69.908500000000004,null,0.2,0,0.8,2230.0915]
[null,0.3,{"$f":"B10*Invoer!$E$9","v":172.5},0,{"$f":"D10*Invoer!$E$9","v":0},0.7,{"$f":"F10*Invoer!$E$9","v":402.5},null,0.3,{"$f":"I10*Invoer!$E$15","v":56.924999999999997},0,{"$f":"K10*Invoer!$E$15","v":0},{"$f":"K10*Invoer!$E$20","v":0},0.7,{"$f":"N10*Invoer!$E$9","v":402.5},null,0.3,{"$f":"IF(Invoer!$F$28,J10*Invoer!$F$28,J10*Invoer!$D$28)","v":1138.5},0,{"$f":"IF(Invoer!$F$29,M10*Invoer!$F$29,M10*Invoer!$D$29)","v":0},0.7,{"$f":"IF(Invoer!$F$27,O10*Invoer!$F$27,O10*Invoer!$D$27)","v":2213.75},null,0.3,{"$f":"Invoer!$D$34*Berekeningen!C10","v":172.5},{"$f":"Berekeningen!C10*Invoer!$D$35","v":345},{"$f":"IF(Invoer!$F$42,J10*Invoer!$F$42,J10*Invoer!$D$42)","v":35.862749999999998},553.36275000000001,0,{"$f":"Invoer!$D$34*E10","v":0},{"$f":"E10*Invoer!$D$35","v":0},{"$f":"L10*Invoer!$D$36","v":0},{"$f":"IF(Invoer!$F$43,Invoer!$F$43*M10,Invoer!$D$43*M10)","v":0},0,0.7,{"$f":"Invoer!$D$34*Berekeningen!G10","v":402.5},{"$f":"IF(Invoer!$F$41,Invoer!$F$41*G10,Invoer!$D$41*G10)","v":201.25},603.75,1157.11275,null,3162.5,null,3352.25,1157.11275,{"$f":"AQ10-AR10","v":2195.1372499999998},2300,-104.86275000000023,null,0.3,0,0.7,-104.86275000000023,null,0.3,0,0.7,2195.1372499999998]
[null,0.4,{"$f":"B11*Invoer!$E$9","v":230},0,{"$f":"D11*Invoer!$E$9","v":0},0.6,{"$f":"F11*Invoer!$E$9","v":345},null,0.4,{"$f":"I11*Invoer!$E$15","v":75.900000000000006},0,{"$f":"K11*Invoer!$E$15","v":0},{"$f":"K11*Invoer!$E$20","v":0},0.6,{"$f":"N11*Invoer!$E$9","v":345},null,0.4,{"$f":"IF(Invoer!$F$28,J11*Invoer!$F$28,J11*Invoer!$D$28)","v":1518},0,{"$f":"IF(Invoer!$F$29,M11*Invoer!$F$29,M11*Invoer!$D$29)","v":0},0.6,{"$f":"IF(Invoer!$F$27,O11*Invoer!$F$27,O11*Invoer!$D$27)","v":1897.5},null,0.4,{"$f":"Invoer!$D$34*Berekeningen!C11","v":230},{"$f":"Berekeningen!C11*Invoer!$D$35","v":460},{"$f":"IF(Invoer!$F$42,J11*Invoer!$F$42,J11*Invoer!$D$42)","v":47.817000000000007},737.81700000000001,0,{"$f":"Invoer!$D$34*E11","v":0},{"$f":"E11*Invoer!$D$35","v":0},{"$f":"L11*Invoer!$D$36","v":0},{"$f":"IF(Invoer!$F$43,Invoer!$F$43*M11,Invoer!$D$43*M11)","v":0},0,0.6,{"$f":"Invoer!$D$34*Berekeningen!G11","v":345},{"$f":"IF(Invoer!$F$41,Invoer!$F$41*G11,Invoer!$D$41*G11)","v":172.5},517.5,1255.317,null,3162.5,null,3415.5,1255.317,2160.183,2300,-139.81700000000001,null,0.4,0,0.6,-139.81700000000001,null,0.4,0,0.6,2160.183]
[null,0.5,{"$f":"B12*Invoer!$E$9","v":287.5},0,{"$f":"D12*Invoer!$E$9","v":0},0.5,{"$f":"F12*Invoer!$E$9","v":287.5},null,0.5,{"$f":"I12*Invoer!$E$15","v":94.875},0,{"$f":"K12*Invoer!$E$15","v":0},{"$f":"K12*Invoer!$E$20","v":0},0.5,{"$f":"N12*Invoer!$E$9","v":287.5},null,0.5,{"$f":"IF(Invoer!$F$28,J12*Invoer!$F$28,J12*Invoer!$D$28)","v":1897.5},0,{"$f":"IF(Invoer!$F$29,M12*Invoer!$F$29,M12*Invoer!$D$29)","v":0},0.5,{"$f":"IF(Invoer!$F$27,O12*Invoer!$F$27,O12*Invoer!$D$27)","v":1581.25},null,0.5,{"$f":"Invoer!$D$34*Berekeningen!C12","v":287.5},{"$f":"Berekeningen!C12*Invoer!$D$35","v":575},{"$f":"IF(Invoer!$F$42,J12*Invoer!$F$42,J12*Invoer!$D$42)","v":59.771250000000002},922.27125000000001,0,{"$f":"Invoer!$D$34*E12","v":0},{"$f":"E12*Invoer!$D$35","v":0},{"$f":"L12*Invoer!$D$36","v":0},{"$f":"IF(Invoer!$F$43,Invoer!$F$43*M12,Invoer!$D$43*M12)","v":0},0,0.5,{"$f":"Invoer!$D$34*Berekeningen!G12","v":287.5},{"$f":"IF(Invoer!$F$41,Invoer!$F$41*G12,Invoer!$D$41*G12)","v":143.75},431.25,1353.52125,null,3162.5,null,3478.75,1353.52125,2125.2287500000002,2300,-174.77124999999978,null,0.5,0,0.5,-174.77124999999978,null,0.5,0,0.5,2125.2287500000002]
[null,0.6,{"$f":"B13*Invoer!$E$9","v":345},0,{"$f":"D13*Invoer!$E$9","v":0},0.4,{"$f":"F13*Invoer!$E$9","v":230},null,0.6,{"$f":"I13*Invoer!$E$15","v":113.85},0,{"$f":"K13*Invoer!$E$15","v":0},{"$f":"K13*Invoer!$E$20","v":0},0.4,{"$f":"N13*Invoer!$E$9","v":230},null,0.6,{"$f":"IF(Invoer!$F$28,J13*Invoer!$F$28,J13*Invoer!$D$28)","v":2277},0,{"$f":"IF(Invoer!$F$29,M13*Invoer!$F$29,M13*Invoer!$D$29)","v":0},0.4,{"$f":"IF(Invoer!$F$27,O13*Invoer!$F$27,O13*Invoer!$D$27)","v":1265},null,0.6,{"$f":"Invoer!$D$34*Berekeningen!C13","v":345},{"$f":"Berekeningen!C13*Invoer!$D$35","v":690},{"$f":"IF(Invoer!$F$42,J13*Invoer!$F$42,J13*Invoer!$D$42)","v":71.725499999999997},1106.7255,0,{"$f":"Invoer!$D$34*E13","v":0},{"$f":"E13*Invoer!$D$35","v":0},{"$f":"L13*Invoer!$D$36","v":0},{"$f":"IF(Invoer!$F$43,Invoer!$F$43*M13,Invoer!$D$43*M13)","v":0},0,0.4,{"$f":"Invoer!$D$34*Berekeningen!G13","v":230},{"$f":"IF(Invoer!$F$41,Invoer!$F$41*G13,Invoer!$D$41*G13)","v":115},345,1451.7255,null,3162.5,null,3542,1451.7255,2090.2745,2300,-209.72550000000001,null,0.6,0,0.4,-209.72550000000001,null,0.6,0,0.4,2090.2745]
[null,0.7,{"$f":"B14*Invoer!$E$9","v":402.5},0,{"$f":"D14*Invoer!$E$9","v":0},0.30000000000000004,{"$f":"F14*Invoer!$E$9","v":172.50000000000003},null,0.7,{"$f":"I14*Invoer!$E$15","v":132.82499999999999},0,{"$f":"K14*Invoer!$E$15","v":0},{"$f":"K14*Invoer!$E$20","v":0},0.30000000000000004,{"$f":"N14*Invoer!$E$9","v":172.50000000000003},null,0.7,{"$f":"IF(Invoer!$F$28,J14*Invoer!$F$28,J14*Invoer!$D$28)","v":2656.5},0,{"$f":"IF(Invoer!$F$29,M14*Invoer!$F$29,M14*Invoer!$D$29)","v":0},0.30000000000000004,{"$f":"IF(Invoer!$F$27,O14*Invoer!$F$27,O14*Invoer!$D$27)","v":948.75000000000011},null,0.7,{"$f":"Invoer!$D$34*Berekeningen!C14","v":402.5},{"$f":"Berekeningen!C14*Invoer!$D$35","v":805},{"$f":"IF(Invoer!$F$42,J14*Invoer!$F$42,J14*Invoer!$D$42)","v":83.679749999999999},1291.17975,0,{"$f":"Invoer!$D$34*E14","v":0},{"$f":"E14*Invoer!$D$35","v":0},{"$f":"L14*Invoer!$D$36","v":0},{"$f":"IF(Invoer!$F$43,Invoer!$F$43*M14,Invoer!$D$43*M14)","v":0},0,0.30000000000000004,{"$f":"Invoer!$D$34*Berekeningen!G14","v":172.50000000000003},{"$f":"IF(Invoer!$F$41,Invoer!$F$41*G14,Invoer!$D$41*G14)","v":86.250000000000014},258.75000000000006,1549.92975,null,3162.5,null,3605.25,1549.92975,2055.3202499999998,2300,-244.67975000000024,null,0.7,0,0.30000000000000004,-244.67975000000024,null,0.7,0,0.30000000000000004,2055.3202499999998]
[null,0.8,{"$f":"B15*Invoer!$E$9","v":460},0,{"$f":"D15*Invoer!$E$9","v":0},0.19999999999999996,{"$f":"F15*Invoer!$E$9","v":114.99999999999997},null,0.8,{"$f":"I15*Invoer!$E$15","v":151.80000000000001},0,{"$f":"K15*Invoer!$E$15","v":0},{"$f":"K15*Invoer!$E$20","v":0},0.19999999999999996,{"$f":"N15*Invoer!$E$9","v":114.99999999999997},null,0.8,{"$f":"IF(Invoer!$F$28,J15*Invoer!$F$28,J15*Invoer!$D$28)","v":3036},0,{"$f":"IF(Invoer!$F$29,M15*Invoer!$F$29,M15*Invoer!$D$29)","v":0},0.19999999999999996,{"$f":"IF(Invoer!$F$27,O15*Invoer!$F$27,O15*Invoer!$D$27)","v":632.49999999999989},null,0.8,{"$f":"Invoer!$D$34*Berekeningen!C15","v":460},{"$f":"Berekeningen!C15*Invoer!$D$35","v":920},{"$f":"IF(Invoer!$F$42,J15*Invoer!$F$42,J15*Invoer!$D$42)","v":95.634000000000015},1475.634,0,{"$f":"Invoer!$D$34*E15","v":0},{"$f":"E15*Invoer!$D$35","v":0},{"$f":"L15*Invoer!$D$36","v":0},{"$f":"IF(Invoer!$F$43,Invoer!$F$43*M15,Invoer!$D$43*M15)","v":0},0,0.19999999999999996,{"$f":"Invoer!$D$34*Berekeningen!G15","v":114.99999999999997},{"$f":"IF(Invoer!$F$41,Invoer!$F$41*G15,Invoer!$D$41*G15)","v":57.499999999999986},172.49999999999994,1648.134,null,3162.5,null,3668.5,1648.134,{"$f":"AQ15-AR15","v":2020.366},2300,-279.63400000000001,null,0.8,0,0.19999999999999996,-279.63400000000001,null,0.8,0,0.19999999999999996,2020.366]
{"$rows_left_out":58}
{"sheet":"Achtergrondgegevens","index":4,"n_rows":6,"n_cols":3,"rows_kept":6,"cut":false,"hidden":true,"merged":[]}
[]
[null,"Rendement"]
[null,"Verse noten",1]
[null,"Droge, ongekraakte walnoten",0.57499999999999996]
[null,"Gekraakte walnoten",0.33]
[null,"Walnootolie",0.55000000000000004]

{"sheet":"Bedrijven","index":5,"n_rows":25,"n_cols":12,"rows_kept":25,"cut":false,"hidden":true,"merged":[]}
[]
[null,"Verwerkingsbedrijven ",null,"* De variabelen prijzen per input product zijn berekend uitgaande van de volgende rendementen (100% droge walnoten, 33% Walnootkernen, 16,5% walnootolie). Om zo de prijzen van de verschillende verwerkers te kunnen vergelijken. De bedrijven met * rekenen echter met een prijs voor het output product. Hierdoor kunnen verschillen door onstaan afhankelijk van het kraak en pers rendementen van de betreffende walnoten.  "]
[]
[null,"Naam","Link ","Land - Prov./Arr.","Plaats ","Proces","Opmerkingen","Min. Kg ","Input Product ","Variabele prijzen (per kg Input product) ","Berekeningen: ","Kolom1"]
[null,"Veld 4","Notenperserij - Veld 4","NL - Gelderland","Zoelen ","Wassen en drogen ",null,700,"Droge Walnoten",0.5]
[null,null,null,null,null,"Kalibreren ",null,700,"Droge Walnoten",0.5]
[null,null,null,null,null,"Kraken  ","Alleen in combinatie met wassen, drogen, kalibreren",1500,"Droge Walnoten",2]
[null,null,null,null,null,"Persen","Olie wordt afgevuld in 5 liter zak met tapkraantje ",10,"Walnootkernen",3.95]
[]
[null,"Hanne Hoeve ","Kraken & persen - Hannehoeve.nl","NL - Noord-Brabant","Westerhoven","Kraken ",null,25,"Droge Walnoten",1]
[null,null,null,null,null,"Kraken + nabewerken","Nabewerken is handmatig slechte kernen verwijderen",0,"Droge Walnoten",2.5]
[null,null,null,null,null,"Persen","Olie wordt afgevuld in glazen flessen van 200 ml. Eigen etiket oplakken is mogelijk ",0,"Walnootkernen",21.08,"Eigen olie terug (in 200 ml fles) * inclusief verpakking\nRendement Droge ongekraakte Noot (100%) - Walnootkernen (33%) - Olie (19,6%):\n5,05 kg - 1,66 kg - 1 l\n1 l olie = € 35,00 \n1,0 kg Walnootkernen persen (€ 35/ 1,66) = € 21,08 ( 0,6 l olie)"]
[]
[null,"Kleine Muyl *","Persen van de walnootolie en hazelnootolie | Oliemolen De Kleine Muyl Walnootolie, Hazelnootolie","NL - Gelderland","Nijbroek","Persen",null,5,"Walnootkernen",null,"Betalen in natura met deel van geperste walnootolie. 5 t/m 10 kg , krijg je terug 200 ml per kg (gepelde noten) Vanaf 10 kg gepelde noten, krijg je terug 250 ml per kg (gepelde noten). \nRendement Droge ongekraakte Noot (100%) - Walnootkernen (33%) - Olie (16,5%). \nVanaf 10 kg: 1 kg kernen - 500 ml olie. 250 ml krijg je terug, je betaald 50% in natura.\n5 t/m 10 kg: 1 kg kernen - 500 ml olie. 200 ml krijg je terug, je betaald 60% in natura. \n Kosten terug te berekenen aan de hand van de verkoopprijs van de walnootolie. "]
[]
{"$rows_left_out":11}
{"sheet":"Verkoopprijzen","index":6,"n_rows":35,"n_cols":10,"rows_kept":35,"cut":false,"hidden":true,"merged":[]}
[]
[null,"Verkoopprijzen","* Verkoopprijzen december 2024 "]
[]
[null,"Product ","Bedrijf ","Afzet","Prijs","Hoeveelheid ","€ per (kg) of (l) ",null,"Gemiddelden "]
[null,"Gepelde Walnoten","De Hanne Hoeve","Particulieren",4.5,"175 g",25.72,null,"Ongepelde Walnoten",{"$f":"AVERAGE(G19:G23)","v":5.5230000000000006}]
[null,"Gepelde Walnoten","De Hanne Hoeve","Particulieren",2.25,"75 g",30,null,"Gepelde Walnoten",{"$f":"AVERAGE(G5:G18)","v":21.271428571428572}]
[null,"Gepelde Walnoten","Veld4","Particulieren",12.25,"700 g ",17.5,null,"Walnootolie",{"$f":"AVERAGE(G28:G34)","v":64.408571428571435}]
[null,"Gepelde Walnoten","Ekoplaza (Huismerk) ","Particulieren",7.49,"500 g ",14.98]
[null,"Gepelde Walnoten","Ekoplaza (Horizon)","Particulieren",3.39,"125 g",27.12]
[null,"Gepelde Walnoten","Ekoplaza (Huismerk) ","Particulieren",4.1900000000000004,"250 g",16.760000000000002]
[null,"Gepelde Walnoten","Ekoplaza (Terrasana)","Particulieren",9.99,"600 g ",16.649999999999999]
[null,"Gepelde Walnoten","Ekoplaza (Wisselwaar)","Particulieren",6.99,"375 g",18.64]
[null,"Gepelde Walnoten","Ekoplaza (Green Age) ","Particulieren",4.1900000000000004,"150 g ",27.93]
[null,"Gepelde Walnoten","Ekoplaza (Your Organic Nature) ","Particulieren",3.49,"200 g ",17.45]
[null,"Gepelde Walnoten","Albert Heijn (Huismerk)","Particulieren",2.59,"200 g ",12.95]
{"$rows_left_out":21}
{"sheet":"Verpakking","index":7,"n_rows":30,"n_cols":6,"rows_kept":30,"cut":false,"hidden":true,"merged":[]}
[]
[null,"Verpakkingen "]
[]
[null,"Olie",null,"Prijs excl. BTW per 100 stuks ","Prijs p/l","Link"]
[null,"Basis ","250 ml Marasca SPP31.5 inlcusief sluiting ",0.9,{"$f":"D5*4","v":3.6},"250ml Marasca SPP31.5 incl sluiting - Glazenflessenenpotten.nl"]
[null,"Luxe ","Glazen fles Apotheker carré, 250 ml, vierkant, monding: kurk + houten greep ",2.5099999999999998,{"$f":"D6*4","v":10.039999999999999},"Glazen fles Apotheker carré, 250 ml, vierkant, monding: kurk | 250,00 | transparant | 100020650"]
[]
[null,"Kernen",null,"Prijs excl. BTW per 100 stuks ","Prijs p/l","Link"]
[null,"Basis","Blokbodemzakjes plastic transparant 60 + 50 x 200 mm - per 100 stuks",6.29,{"$f":"(D9/100)*10","v":0.629},"Blokbodemzakjes 60 + 50 x 200 mm Transparant (100 stuks)"]
[null,"Luxe ","Blokbodemzakjes kraftpapier met venster 80 + 50 x 250 mm - per 100 stuks",12.62,{"$f":"(D10/100)*10","v":1.2619999999999998},"Blokbodemzakjes 80 + 50 x 250 mm Kraft met Venster (100 stuks)"]
[]
[]
[]
[]
[]
{"$rows_left_out":16}
{"sheet":"Productiviteit","index":8,"n_rows":55,"n_cols":2,"rows_kept":55,"cut":false,"hidden":true,"merged":[]}
[]
[null,"Productiviteit "]
[]
[null,"Bron: Rekentool 5.0 Voedselbossen (HAS)"]
[null,"https://www.has.nl/onderzoek/onderzoeksprojecten/agroforestry-en-voedselbossen/ "]
[]
[]
[]
[]
[]
[null,"Bron: Informatiefiche Walnoot (Juglans regia en Juglans nigra) (Agroforestry Vlaanderen, 2021) "]
[null,"Walnoot - Agroforestry"]
[null,"De notenopbrengst is afhankelijk van het ras, de leeftijd van de boom, de plantafstand, en het jaar. De productie begint, bij goede groeiomstandigheden, vanaf jaar zeven na aanleg op gang te komen. De gemiddelde productie van jaar zeven tot tien bedraagt 1 kg (droge) noten per boom. Bij een leeftijd van tien jaar kan de productie op 5 kg per boom gesteld worden, en bij twintig jaar op 10 kg noten per boom. De volledige productie (gemiddeld 18 kg per boom) wordt na dertig jaar verwacht, en kan aanhouden tot ongeveer jaar vijftig. Er zijn echter goede en slechte notenjaren, vermits ongunstige weersomstandigheden tijdens de bloei de vruchtzetting nadelig kunnen beïnvloeden. Bovendien is het weer in de zomer bepalend voor de vruchtkwaliteit."]
[]
[]
{"$rows_left_out":41}
{"sheet":"Opties dropdown","index":9,"n_rows":15,"n_cols":9,"rows_kept":15,"cut":false,"hidden":true,"merged":[]}
[null,null,null,null,null,null,"Verpakking"]
["Ongekraakte walnoten","Laag",4,null,null,null,"Ongekraakte walnoten","Basis",0.5]
[null,"Middel",5.5,null,null,null,null,"Luxe",0.5]
[null,"Hoog",7,null,null,null,null,"Eigen invoer",0]
[null,"Eigen invoer",0]
[null,null,null,null,null,null,"Gekraakte walnoten","Basis",0.63]
["Gekraakte walnoten","Laag",12,null,null,null,null,"Luxe",1.26]
[null,"Middel",20,null,null,null,null,"Eigen invoer",0]
[null,"Hoog",28]
[null,"Eigen invoer",0,null,null,null,"Olie","Basis",{"$f":"3.6+Verpakking!E30","v":4.9584000000000001}]
[null,null,null,null,null,null,null,"Luxe",{"$f":"Verpakking!E6+Verpakking!E30","v":11.398399999999999}]
["Olie","Laag",45,null,null,null,null,"Eigen invoer",0]
[null,"Middel",60]
[null,"Hoog",75]
[null,"Eigen invoer",0]